{"text_format":"1","workbook":"xlsx","n_sheets":8,"sheets":["Prices Vertical","Prices","Info Key","COVER","Heavy Lamb Prices","Light Lamb Prices","Graphs","Monthly prices"],"not_rendered":{"charts":15,"images":5,"macros":1,"external_links":0,"defined_names":30,"comments":0,"pivot_tables":0},"unopened":[],"bounds":{"document_bytes":16777216,"sheet_cells":100000,"rows_first":2000,"rows_last":500,"rows_between":2000,"halvings":0,"cell_chars":16384,"cell_head_chars":4096},"cells_cut":0,"cells_raw":0,"read":"whole","date_system":"1900"}

{"sheet":"Prices Vertical","index":0,"n_rows":0,"n_cols":0,"rows_kept":0,"cut":false,"hidden":true,"merged":[]}

{"sheet":"Prices","index":1,"n_rows":94,"n_cols":28,"rows_kept":94,"cut":false,"hidden":true,"merged":[[1,0,2,1],[42,0,42,3]]}
[]
["€ur per 100 kg carcasses"]
[]
[null,null,null,null,null,null,null,null,null,null,null," "]
["HEAVY LAMBS",null,null,"EU_H"]
["Week beginning"]
["Country Code","Weights (%)","2012-12-24",{"$f":"+C7+7","v":"2012-12-31"},{"$f":"+D7+7","v":"2013-01-07"},"2013-01-14","2013-01-21","2013-01-28","2013-02-04","2013-02-11","2013-02-18","2013-02-25","2013-03-04","2013-03-11","2013-03-18","2013-03-25","2013-04-01","2013-04-08","2013-04-15","2013-04-22","2013-04-29","2013-05-06","2013-05-13","2013-05-20","2013-05-27",null,"% over prev ","% over prev "]
[null,null,"52","01","02","03","04","05","06","07","08","09","10","11","12","13","14","15","16","17","18","19","20","21","22",null,"week","year"]
["BE",0.46,{"$f":"VLOOKUP($A9&$D$5&C$7,#REF!,12,0)","v":{"$error":"#REF!"}},{"$f":"VLOOKUP($A9&$D$5&D$7,#REF!,12,0)","v":{"$error":"#REF!"}},{"$f":"VLOOKUP($A9&$D$5&E$7,#REF!,12,0)","v":{"$error":"#REF!"}},{"$f":"VLOOKUP($A9&$D$5&F$7,#REF!,12,0)","v":{"$error":"#REF!"}},{"$f":"VLOOKUP($A9&$D$5&G$7,#REF!,12,0)","v":{"$error":"#REF!"}},{"$f":"VLOOKUP($A9&$D$5&H$7,#REF!,12,0)","v":{"$error":"#REF!"}},{"$f":"VLOOKUP($A9&$D$5&I$7,#REF!,12,0)","v":{"$error":"#REF!"}},{"$f":"VLOOKUP($A9&$D$5&J$7,#REF!,12,0)","v":{"$error":"#REF!"}},{"$f":"VLOOKUP($A9&$D$5&K$7,#REF!,12,0)","v":{"$error":"#REF!"}},{"$f":"VLOOKUP($A9&$D$5&L$7,#REF!,12,0)","v":{"$error":"#REF!"}},{"$f":"VLOOKUP($A9&$D$5&M$7,#REF!,12,0)","v":{"$error":"#REF!"}},{"$f":"VLOOKUP($A9&$D$5&N$7,#REF!,12,0)","v":{"$error":"#REF!"}},{"$f":"VLOOKUP($A9&$D$5&O$7,#REF!,12,0)","v":{"$error":"#REF!"}},{"$f":"VLOOKUP($A9&$D$5&P$7,#REF!,12,0)","v":{"$error":"#REF!"}},{"$f":"VLOOKUP($A9&$D$5&Q$7,#REF!,12,0)","v":{"$error":"#REF!"}},{"$f":"VLOOKUP($A9&$D$5&R$7,#REF!,12,0)","v":{"$error":"#REF!"}},{"$f":"VLOOKUP($A9&$D$5&S$7,#REF!,12,0)","v":{"$error":"#REF!"}},{"$f":"VLOOKUP($A9&$D$5&T$7,#REF!,12,0)","v":{"$error":"#REF!"}},{"$f":"VLOOKUP($A9&$D$5&U$7,#REF!,12,0)","v":{"$error":"#REF!"}},{"$f":"VLOOKUP($A9&$D$5&V$7,#REF!,12,0)","v":{"$error":"#REF!"}},{"$f":"VLOOKUP($A9&$D$5&W$7,#REF!,12,0)","v":{"$error":"#REF!"}},{"$f":"VLOOKUP($A9&$D$5&X$7,#REF!,12,0)","v":{"$error":"#REF!"}},{"$f":"VLOOKUP($A9&$D$5&Y$7,#REF!,12,0)","v":{"$error":"#REF!"}},null,{"$f":"+(Y9/X9)-1","v":{"$error":"#REF!"}},{"$error":"#N/A"}]
["DK",0.26,null,null,null,null,null,null,null,null,null,null,null,null,null,null,{"$f":"VLOOKUP($A10&$D$5&Q$7,#REF!,12,0)","v":{"$error":"#REF!"}},{"$f":"VLOOKUP($A10&$D$5&R$7,#REF!,12,0)","v":{"$error":"#REF!"}},{"$f":"VLOOKUP($A10&$D$5&S$7,#REF!,12,0)","v":{"$error":"#REF!"}},{"$f":"VLOOKUP($A10&$D$5&T$7,#REF!,12,0)","v":{"$error":"#REF!"}},{"$f":"VLOOKUP($A10&$D$5&U$7,#REF!,12,0)","v":{"$error":"#REF!"}},{"$f":"VLOOKUP($A10&$D$5&V$7,#REF!,12,0)","v":{"$error":"#REF!"}},{"$f":"VLOOKUP($A10&$D$5&W$7,#REF!,12,0)","v":{"$error":"#REF!"}},{"$f":"VLOOKUP($A10&$D$5&X$7,#REF!,12,0)","v":{"$error":"#REF!"}},{"$f":"VLOOKUP($A10&$D$5&Y$7,#REF!,12,0)","v":{"$error":"#REF!"}},null,{"$error":"#REF!"}]
{"$rows_left_out":85}
{"sheet":"Info Key","index":2,"n_rows":4,"n_cols":7,"rows_kept":4,"cut":false,"hidden":true,"merged":[[1,0,2,1]]}
[]
[null,null,null,null,null,null,"VLOOKUP($A14&\"EU_H\"&AC$7;AMIS2_data!$A:$R;12;0)"]
[]
[null,null,null,null,null,null,"VLOOKUP($A14&\"EU_L\"&AC$7;AMIS2_data!$A:$R;12;0)"]

{"sheet":"COVER","index":3,"n_rows":42,"n_cols":10,"rows_kept":42,"cut":false,"hidden":false,"merged":[[34,9,34,10],[36,9,36,10],[35,9,35,10]]}
["Weekly price report on"]
["Heavy Lamb and Light Lamb prices"]
["in the EU"]
[]
[null,null,null,null,"Note:"]
[null,null,null,null,"New Weighing Coefficients from 01.07.2013"]
[null,null,null,null,"As from 2013 Cyprus communicates Heavy Lamb"]
[null,null,null,null,"instead of light lamb"]
[]
[]
{"$rows_left_out":33}
{"sheet":"Heavy Lamb Prices","index":4,"n_rows":506,"n_cols":48,"rows_kept":506,"cut":false,"hidden":false,"merged":[[66,0,66,41],[5,17,5,27],[3,17,4,27],[8,2,8,7],[14,0,14,41],[10,0,10,1],[11,0,11,1],[12,0,12,1],[7,37,8,41],[9,0,9,1],[7,0,7,2]]}
["COMMISSION EUROPEENNE",null,null,null,null,null,null,null,null,null,null,null,null,null,null,null,null,null,null,null,null,null,null,null,null,null,null,null,null,null,null,null,null,null,null,null,null,null,null,null,null,null,null,"Week",{"$f":"COVER!G35","v":34}]
["Direction générale de l'Agriculture"]
["C4. Produits animaux"]
[null,null,null,null,null,null,null,null,null,null,null,null,null,null,null,null,null,"HEAVY LAMB PRICE"]
[]
[null,null,null,null,null,null,null,null,null,null,null,null,null,null,null,null,null,"DG-Agri-C4,  Meat sector"]
[null,null,null,null,null,null,null,null,null,null," "]
["HEAVY LAMB",null,null,null,null,null,null,null,null,null,null,null,null,null,null,null,null,null,null,null,null,null,null,null,null,null,null,null,null,null,null,null,null,null,null,null,null,"€ur per 100 kg carcass"]
["EU_H",null,"Country Code/Currency"]
[2013,null,"BE","BG","BG","CZ","CZ","DK","DK","DE","EE","GR","ES","FR","HR","HR","IE","IT","CY","LV","LV","LT","LT","LU","HU","HU","MT","NL","AT","PL","PL","PT","RO","RO","SI","SK","FI","SE","SE","NI","GB","UK",null,"EU_27"]
{"$rows_left_out":497}
{"sheet":"Light Lamb Prices","index":5,"n_rows":506,"n_cols":44,"rows_kept":506,"cut":false,"hidden":false,"merged":[[7,0,7,2],[3,16,4,26],[7,37,8,40],[66,0,66,40],[14,0,14,40],[5,15,5,25],[8,2,8,7],[10,0,10,1],[11,0,11,1],[12,0,12,1],[9,0,9,1]]}
["COMMISSION EUROPEENNE",null,null,null,null,null,null,null,null,null,null,null,null,null,null,null,null,null,null,null,null,null,null,null,null,null,null,null,null,null,null,null,null,null,null,null,null,null,null,null,null,null,"Week",{"$f":"COVER!G35","v":34}]
["Direction générale de l'Agriculture"]
["C4. Produits animaux"]
[null,null,null,null,null,null,null,null,null,null,null,null,null,null,null,null,"LIGHT LAMB PRICE"]
[]
[null,null,null,null,null,null,null,null,null,null,null,null,null,null,null,"DG-Agri-C4,  Meat sector"]
[null,null,null,null,null,null,null,null,null,null," "]
["LIGHT LAMB",null,null,null,null,null,null,null,null,null,null,null,null,null,null,null,null,null,null,null,null,null,null,null,null,null,null,null,null,null,null,null,null,null,null,null,null,"€ur per 100 kg carcass"]
["EU_L",null,"Country Code/Currency"]
[2013,null,"BE","BG","BG","CZ","CZ","DK","DK","DE","EE","GR","ES","FR","HR","HR","IE","IT","CY","LV","LV","LT","LT","LU","HU","HU","MT","NL","AT","PL","PL","PT","RO","RO","SI","SK","FI","SE","SEK","GB","GBP",null,"EU_27"]
{"$rows_left_out":497}
{"sheet":"Graphs","index":6,"n_rows":52,"n_cols":46,"rows_kept":52,"cut":false,"hidden":false,"merged":[]}
[null,null,null,null,null,null,null,null,null,null,null,null,null,null,null,null,null,2,664.86160000000007,718.40980000000002,642.12220000000002,548.02819999999997,610.51620000000003,{"$f":"IF('Light Lamb Prices'!$AQ70=0,NA(),'Light Lamb Prices'!$AQ70)","v":647.20995459999995},null,2,355.65270000000004,401.0616,455.99370000000005,461.4178,518.92529999999999,{"$f":"IF('Heavy Lamb Prices'!$AR70=0,NA(),'Heavy Lamb Prices'!$AR70)","v":438.05849752900002},null,null,{"$f":"+#REF!+7","v":{"$error":"#REF!"}},3,{"$f":"IF('Light Lamb Prices'!M71=0,NA(),'Light Lamb Prices'!M71)","v":671.39},{"$f":"IF('Heavy Lamb Prices'!AO71=0,NA(),'Heavy Lamb Prices'!AO71)","v":393.31990000000002},{"$f":"IF('Heavy Lamb Prices'!AD71=0,NA(),'Heavy Lamb Prices'!AD71)","v":406.06909999999999},{"$f":"IF('Heavy Lamb Prices'!N71=0,NA(),'Heavy Lamb Prices'!N71)","v":598},{"$f":"IF('Light Lamb Prices'!AJ71=0,NA(),'Light Lamb Prices'!AJ71)","v":680.47},{"$f":"IF('Light Lamb Prices'!R71=0,NA(),'Light Lamb Prices'!R71)","v":611.55000000000007},{"$f":"IF('Heavy Lamb Prices'!AG71=0,NA(),'Heavy Lamb Prices'!AG71)","v":236.38720000000001},383.49116808218957,277.08803149735223,268.93787575150299]
[null,null,null,null,null,null,null,null,null,null,null,null,null,null,null,null,null,3,653.11570000000006,671.74009999999998,603.6576,533.79090000000008,588.69760000000008,{"$f":"IF('Light Lamb Prices'!$AQ71=0,NA(),'Light Lamb Prices'!$AQ71)","v":577.85146940000004},null,3,356.71,408.08850000000001,443.41450000000003,464.76580000000001,513.82380000000001,{"$f":"IF('Heavy Lamb Prices'!$AR71=0,NA(),'Heavy Lamb Prices'!$AR71)","v":426.84707899394999},null,null,{"$f":"+AI1+7","v":{"$error":"#REF!"}},4,{"$f":"IF('Light Lamb Prices'!M72=0,NA(),'Light Lamb Prices'!M72)","v":634.30000000000007},{"$f":"IF('Heavy Lamb Prices'!AO72=0,NA(),'Heavy Lamb Prices'!AO72)","v":395.46010000000001},{"$f":"IF('Heavy Lamb Prices'!AD72=0,NA(),'Heavy Lamb Prices'!AD72)","v":323.4769},{"$f":"IF('Heavy Lamb Prices'!N72=0,NA(),'Heavy Lamb Prices'!N72)","v":582},{"$f":"IF('Light Lamb Prices'!AJ72=0,NA(),'Light Lamb Prices'!AJ72)","v":680.47},{"$f":"IF('Light Lamb Prices'!R72=0,NA(),'Light Lamb Prices'!R72)","v":611.55000000000007},{"$f":"IF('Heavy Lamb Prices'!AG72=0,NA(),'Heavy Lamb Prices'!AG72)","v":268.04990000000004},379.35489970534013,275.98821028545336,269.77549299295737]
[null,null,null,null,null,null,null,null,null,null,null,null,null,null,null,null,null,4,585.30730000000005,650.62080000000003,579.71630000000005,531.12080000000003,576.65010000000007,{"$f":"IF('Light Lamb Prices'!$AQ72=0,NA(),'Light Lamb Prices'!$AQ72)","v":558.66931599999998},null,4,357.75260000000003,402.2414,444.6157,456.00130000000001,512.351,{"$f":"IF('Heavy Lamb Prices'!$AR72=0,NA(),'Heavy Lamb Prices'!$AR72)","v":428.41720215305003},null,null,{"$error":"#REF!"},5,{"$f":"IF('Light Lamb Prices'!M73=0,NA(),'Light Lamb Prices'!M73)","v":615.1},{"$f":"IF('Heavy Lamb Prices'!AO73=0,NA(),'Heavy Lamb Prices'!AO73)","v":389.08340000000004},{"$f":"IF('Heavy Lamb Prices'!AD73=0,NA(),'Heavy Lamb Prices'!AD73)","v":344.01679999999999},{"$f":"IF('Heavy Lamb Prices'!N73=0,NA(),'Heavy Lamb Prices'!N73)","v":577},{"$f":"IF('Light Lamb Prices'!AJ73=0,NA(),'Light Lamb Prices'!AJ73)","v":680.47},{"$f":"IF('Light Lamb Prices'!R73=0,NA(),'Light Lamb Prices'!R73)","v":612.80000000000007},{"$f":"IF('Heavy Lamb Prices'!AG73=0,NA(),'Heavy Lamb Prices'!AG73)","v":236.51270000000002},380.06397428422861,262.83468131449496,279.50373954020063]
[null,null,null,null,null,null,null,null,null,null,null,null,null,null,null,null,null,5,551.19670000000008,631.1508,565.46699999999998,525.7921,576.99459999999999,{"$f":"IF('Light Lamb Prices'!$AQ73=0,NA(),'Light Lamb Prices'!$AQ73)","v":542.38499249999984},null,5,361.00210000000004,403.2285,444.35970000000003,458.65790000000004,514.71379999999999,{"$f":"IF('Heavy Lamb Prices'!$AR73=0,NA(),'Heavy Lamb Prices'!$AR73)","v":419.81183487102504},null,null,{"$error":"#REF!"},6,{"$f":"IF('Light Lamb Prices'!M74=0,NA(),'Light Lamb Prices'!M74)","v":619.32000000000005},{"$f":"IF('Heavy Lamb Prices'!AO74=0,NA(),'Heavy Lamb Prices'!AO74)","v":404.01890000000003},{"$f":"IF('Heavy Lamb Prices'!AD74=0,NA(),'Heavy Lamb Prices'!AD74)","v":359.68119999999999},{"$f":"IF('Heavy Lamb Prices'!N74=0,NA(),'Heavy Lamb Prices'!N74)","v":568},{"$f":"IF('Light Lamb Prices'!AJ74=0,NA(),'Light Lamb Prices'!AJ74)","v":680.47},{"$f":"IF('Light Lamb Prices'!R74=0,NA(),'Light Lamb Prices'!R74)","v":612.80000000000007},{"$f":"IF('Heavy Lamb Prices'!AG74=0,NA(),'Heavy Lamb Prices'!AG74)","v":252.72240000000002},373.46130571662746,257.46044131986514,278.53502885761395]
[null,null,null,null,null,null,null,null,null,null,null,null,null,null,null,null,null,6,546.35410000000002,626.55520000000001,574.07370000000003,527.34400000000005,585.27539999999999,{"$f":"IF('Light Lamb Prices'!$AQ74=0,NA(),'Light Lamb Prices'!$AQ74)","v":547.96730635999995},null,6,373.28680000000003,416.95749999999998,438.92270000000002,461.83770000000004,513.9556,{"$f":"IF('Heavy Lamb Prices'!$AR74=0,NA(),'Heavy Lamb Prices'!$AR74)","v":428.81778488185012},null,null,{"$error":"#REF!"},7,{"$f":"IF('Light Lamb Prices'!M75=0,NA(),'Light Lamb Prices'!M75)","v":615.19000000000005},{"$f":"IF('Heavy Lamb Prices'!AO75=0,NA(),'Heavy Lamb Prices'!AO75)","v":419.12260000000003},{"$f":"IF('Heavy Lamb Prices'!AD75=0,NA(),'Heavy Lamb Prices'!AD75)","v":359.68119999999999},{"$f":"IF('Heavy Lamb Prices'!N75=0,NA(),'Heavy Lamb Prices'!N75)","v":552},{"$f":"IF('Light Lamb Prices'!AJ75=0,NA(),'Light Lamb Prices'!AJ75)","v":692.58},{"$f":"IF('Light Lamb Prices'!R75=0,NA(),'Light Lamb Prices'!R75)","v":611.27},{"$f":"IF('Heavy Lamb Prices'!AG75=0,NA(),'Heavy Lamb Prices'!AG75)","v":221.45490000000001},377.86578219672305,251.64687149463771,279.90797546012271]
[null,null,null,null,null,null,null,null,null,null,null,null,null,null,null,null,null,7,558.00160000000005,612.1155,566.91250000000002,534.52970000000005,584.96370000000002,{"$f":"IF('Light Lamb Prices'!$AQ75=0,NA(),'Light Lamb Prices'!$AQ75)","v":545.24253806000002},null,7,378.4556,416.6549,434.66540000000003,469.7099,512.46210000000008,{"$f":"IF('Heavy Lamb Prices'!$AR75=0,NA(),'Heavy Lamb Prices'!$AR75)","v":429.57304480564994},null,null,{"$error":"#REF!"},8,{"$f":"IF('Light Lamb Prices'!M76=0,NA(),'Light Lamb Prices'!M76)","v":614.09},{"$f":"IF('Heavy Lamb Prices'!AO76=0,NA(),'Heavy Lamb Prices'!AO76)","v":419.97680000000003},{"$f":"IF('Heavy Lamb Prices'!AD76=0,NA(),'Heavy Lamb Prices'!AD76)","v":361.56280000000004},{"$f":"IF('Heavy Lamb Prices'!N76=0,NA(),'Heavy Lamb Prices'!N76)","v":548},{"$f":"IF('Light Lamb Prices'!AJ76=0,NA(),'Light Lamb Prices'!AJ76)","v":392.58},{"$f":"IF('Light Lamb Prices'!R76=0,NA(),'Light Lamb Prices'!R76)","v":611.27},{"$f":"IF('Heavy Lamb Prices'!AG76=0,NA(),'Heavy Lamb Prices'!AG76)","v":252.21730000000002},371.04841860144467,253.29505200780653,285.29570514303339]
[null,null,null,null,null,null,null,null,null,null,null,null,null,null,null,null,null,8,560.98829999999998,593.76200000000006,565.38340000000005,539.12310000000002,584.10320000000002,{"$f":"IF('Light Lamb Prices'!$AQ76=0,NA(),'Light Lamb Prices'!$AQ76)","v":539.04634644000009},null,8,379.23380000000003,415.87900000000002,435.92060000000004,481.61660000000001,509.81690000000003,{"$f":"IF('Heavy Lamb Prices'!$AR76=0,NA(),'Heavy Lamb Prices'!$AR76)","v":434.71061939314995},null,null,{"$error":"#REF!"},9,{"$f":"IF('Light Lamb Prices'!M77=0,NA(),'Light Lamb Prices'!M77)","v":609.72},{"$f":"IF('Heavy Lamb Prices'!AO77=0,NA(),'Heavy Lamb Prices'!AO77)","v":427.57440000000003},{"$f":"IF('Heavy Lamb Prices'!AD77=0,NA(),'Heavy Lamb Prices'!AD77)","v":362.87330000000003},{"$f":"IF('Heavy Lamb Prices'!N77=0,NA(),'Heavy Lamb Prices'!N77)","v":547},{"$f":"IF('Light Lamb Prices'!AJ77=0,NA(),'Light Lamb Prices'!AJ77)","v":392.73},{"$f":"IF('Light Lamb Prices'!R77=0,NA(),'Light Lamb Prices'!R77)","v":610.73},{"$f":"IF('Heavy Lamb Prices'!AG77=0,NA(),'Heavy Lamb Prices'!AG77)","v":252.84640000000002},369.78452535063462,246.84434818218125,312.34727422614407]
[null,null,null,null,null,null,null,null,null,null,null,null,null,null,null,null,null,9,569.21580000000006,571.08479999999997,565.75670000000002,538.68450000000007,584.02460000000008,{"$f":"IF('Light Lamb Prices'!$AQ77=0,NA(),'Light Lamb Prices'!$AQ77)","v":535.11339382000006},null,9,381.4323,412.03210000000001,432.10580000000004,478.80580000000003,511.66110000000003,{"$f":"IF('Heavy Lamb Prices'!$AR77=0,NA(),'Heavy Lamb Prices'!$AR77)","v":439.60205900232495},null,null,{"$f":"+AI7+7","v":{"$error":"#REF!"}},10,{"$f":"IF('Light Lamb Prices'!M78=0,NA(),'Light Lamb Prices'!M78)","v":629.9},{"$f":"IF('Heavy Lamb Prices'!AO78=0,NA(),'Heavy Lamb Prices'!AO78)","v":464.4796},{"$f":"IF('Heavy Lamb Prices'!AD78=0,NA(),'Heavy Lamb Prices'!AD78)","v":363.93950000000001},{"$f":"IF('Heavy Lamb Prices'!N78=0,NA(),'Heavy Lamb Prices'!N78)","v":559},{"$f":"IF('Light Lamb Prices'!AJ78=0,NA(),'Light Lamb Prices'!AJ78)","v":392.73},{"$f":"IF('Light Lamb Prices'!R78=0,NA(),'Light Lamb Prices'!R78)","v":610.73},{"$f":"IF('Heavy Lamb Prices'!AG78=0,NA(),'Heavy Lamb Prices'!AG78)","v":230.48420000000002},387.73587165707073,247.61448836815069,336.8842970490968]
[null,null,null,null,null,null,null,null,null,null,null,null,null,null,null,null,null,10,569.50030000000004,555.47760000000005,571.97130000000004,540.58120000000008,586.61620000000005,{"$f":"IF('Light Lamb Prices'!$AQ78=0,NA(),'Light Lamb Prices'!$AQ78)","v":542.11105415999998},null,10,385.53020000000004,410.98850000000004,434.50290000000001,488.23270000000002,514.59960000000001,{"$f":"IF('Heavy Lamb Prices'!$AR78=0,NA(),'Heavy Lamb Prices'!$AR78)","v":461.39457505827494},null,null,{"$error":"#REF!"},11,{"$f":"IF('Light Lamb Prices'!M79=0,NA(),'Light Lamb Prices'!M79)","v":599.54},{"$f":"IF('Heavy Lamb Prices'!AO79=0,NA(),'Heavy Lamb Prices'!AO79)","v":495.12100000000004},{"$f":"IF('Heavy Lamb Prices'!AD79=0,NA(),'Heavy Lamb Prices'!AD79)","v":361.38100000000003},{"$f":"IF('Heavy Lamb Prices'!N79=0,NA(),'Heavy Lamb Prices'!N79)","v":567},{"$f":"IF('Light Lamb Prices'!AJ79=0,NA(),'Light Lamb Prices'!AJ79)","v":489.32},{"$f":"IF('Light Lamb Prices'!R79=0,NA(),'Light Lamb Prices'!R79)","v":586.20000000000005},{"$f":"IF('Heavy Lamb Prices'!AG79=0,NA(),'Heavy Lamb Prices'!AG79)","v":235.47970000000001},386.21862697341629,246.55455809836894,338.50196778812131]
[null,null,null,null,null,null,null,null,null,null,null,null,null,null,null,null,null,11,591.60180000000003,551.04420000000005,579.26220000000001,543.84670000000006,586.15030000000002,{"$f":"IF('Light Lamb Prices'!$AQ79=0,NA(),'Light Lamb Prices'!$AQ79)","v":527.88250552},null,11,402.33790000000005,407.82350000000002,441.2885,501.06350000000003,520.0856,{"$f":"IF('Heavy Lamb Prices'!$AR79=0,NA(),'Heavy Lamb Prices'!$AR79)","v":482.16623591927504},null,null,{"$error":"#REF!"},12,{"$f":"IF('Light Lamb Prices'!M80=0,NA(),'Light Lamb Prices'!M80)","v":568.16999999999996},{"$f":"IF('Heavy Lamb Prices'!AO80=0,NA(),'Heavy Lamb Prices'!AO80)","v":532.32029999999997},{"$f":"IF('Heavy Lamb Prices'!AD80=0,NA(),'Heavy Lamb Prices'!AD80)","v":370.81440000000003},{"$f":"IF('Heavy Lamb Prices'!N80=0,NA(),'Heavy Lamb Prices'!N80)","v":589},{"$f":"IF('Light Lamb Prices'!AJ80=0,NA(),'Light Lamb Prices'!AJ80)","v":474.14},{"$f":"IF('Light Lamb Prices'!R80=0,NA(),'Light Lamb Prices'!R80)","v":694.23},{"$f":"IF('Heavy Lamb Prices'!AG80=0,NA(),'Heavy Lamb Prices'!AG80)","v":246.82330000000002},390.77036102437972,249.00128139890197,336.69473512423247]
{"$rows_left_out":43}
{"sheet":"Monthly prices","index":7,"n_rows":92,"n_cols":88,"rows_kept":92,"cut":false,"hidden":false,"merged":[[1,0,1,8],[1,86,1,89]]}
[null,null,null,null,null,null,"|",null,null,null,null,null,2007,null,null,null,null,null,"|",null,null,null,null,null,2008,null,null,null,null,null,"|",null,null,null,null,null,2009,null,null,null,null,null,"|",null,null,null,null,null,2010,null,null,null,null,null,"|",null,null,null,null,null,2011,null,null,null,null,null,"|",null,null,null,null,null,2012,null,null,null,null,null,"|",null,null,null,null,null,null,2013]
["€UR per 100 kg carcasses weight",null,null,null,null,null,null,null,null,null,null,null,null,null,null,null,null,null,null,null,null,null,null,null,null,null,null,null,null,null,null,null,null,null,null,null,null,null,null,null,null,null,null,null,null,null,null,null,null,null,null,null,null,null,null,null,null,null,null,null,null,null,null,null,null,null,null,null,null,null,null,null,null,null,null,null,null,null,null,null,null,null,null,null,null,null,"€UR per 100 kg carcasses weight"]
[]
[]
["HEAVY LAMBS",null,null,null,null,null,null,null,null,null,null,null,null,null,null,null,null,null,null,null,null,null,null,null,null,null,null,null,null,null,null,null,null,null,null,null,null,null,null,null,null,null,null,null,null,null,null,null,null,null,null,null,null,null,null,null,null,null,null,null,null,null,null,null,null,null,null,null,null,null,null,null,null,null,null,null,null,null,null,null,null,null,null,null,null,null,"HEAVY LAMBS"]
[null,null,null,null,null,null,"Month beginning"]
[null,">2011",2011,2012,"2013-I","2013-II","2007-01-01","2007-02-01","2007-03-01","2007-04-01","2007-05-01","2007-06-01","2007-07-01","2007-08-01","2007-09-01","2007-10-01","2007-11-01","2007-12-01","2008-01-01","2008-02-01","2008-03-01","2008-04-01","2008-05-01","2008-06-01","2008-07-01","2008-08-01","2008-09-01","2008-10-01","2008-11-01","2008-12-01","2009-01-01","2009-02-01","2009-03-01","2009-04-01","2009-05-01","2009-06-01","2009-07-01","2009-08-01","2009-09-01","2009-10-01","2009-11-01","2009-12-01","2010-01-01","2010-02-01","2010-03-01","2010-04-01","2010-05-01","2010-06-01","2010-07-01","2010-08-01","2010-09-01","2010-10-01","2010-11-01","2010-12-01","2011-01-01","2011-02-01","2011-03-01","2011-04-01","2011-05-01","2011-06-01","2011-07-01","2011-08-01","2011-09-01","2011-10-01","2011-11-01","2011-12-01","2012-01-01","2012-02-01","2012-03-01","2012-04-01","2012-05-01","2012-06-01","2012-07-01","2012-08-01","2012-09-01","2012-10-01","2012-11-01","2012-12-01","2013-01-01","2013-02-01","2013-03-01","2013-04-01","2013-05-01","2013-06-01","2013-07-01"]
[null,"Weights (%)","Weights (%)","Weights (%)","Weights (%)","Weights (%)",null,null,null,null,null,null,null,null,null,null,null,null,null,null,null,null,null,null,null,null,null,null,null,null,null,null,null,null,null,null,null,null,null,null,null,null,null,null,null,null,null,null,null,null,null,null,null,null,null,null,null,null,null,null,null,null,null,null,null,null,null,null,null,null,null,null,null,null,null,null,null,null,null,null,null,null,null,null,null,null,null,"Weights (%)"]
["BE",0.26,0.53,0.53,0.46,0.43,404.15390000000002,405.06390000000005,412.34230000000002,449.37330000000003,439.00030000000004,430.49770000000001,418.95100000000002,424.33350000000002,428.27570000000003,420.66840000000002,433.06300000000005,433.8845,429.73520000000002,441.0976,494.01060000000001,522.7903,514.75419999999997,469.63300000000004,458.96520000000004,433.38580000000002,427.57570000000004,442.07190000000003,445.57930000000005,450.31450000000001,455.07420000000002,458.38140000000004,476.97710000000001,512.85230000000001,528.43900000000008,520.92100000000005,467.72060000000005,455.88840000000005,433.44,412.53579999999999,441.52730000000003,442.50870000000003,436.52160000000003,443.93,468.48650000000004,526.50630000000001,509.51550000000003,456.41,410.85230000000001,404.81479999999999,427.267,455.15480000000002,482.41200000000003,437.79520000000002,430.45580000000001,429.29500000000002,465.02550000000002,526.02200000000005,531.35059999999999,489.08070000000004,442.47580000000005,443.65710000000001,467.55330000000004,494.4119,506.58530000000002,452.99190000000004,444.82740000000001,439.59190000000001,499.09060000000005,587.245,558.37609999999995,501.59800000000001,477.8048,490.05869999999999,519.02329999999995,552.39189999999996,512.32420000000002,480.8229,449.9855,451.08499999999998,504.51229999999998,544.88670000000002,522.58029999999997,488.9307,486.43329999999997,null,"BE",0.46]
["DK",null,null,null,0.26,0.28000000000000003,null,null,null,null,null,null,null,null,null,null,null,null,null,null,null,null,null,null,null,null,null,null,null,null,null,null,null,null,null,null,null,null,null,null,null,null,null,null,null,null,null,null,null,null,null,null,null,null,null,null,null,null,null,null,null,null,null,null,null,null,null,null,null,null,null,null,null,null,null,null,null,null,null,null,466.22121372794822,482.0598,483.30650000000003,487.77019999999999,486.92959999999999,null,"DK",0.26]
{"$rows_left_out":82}